Reaction Details
TargetReverse transcriptase/RNaseH
LigandBDBM50036599
Substrate/Competitorn/a
Meas. Tech.ChEMBL_195058 (CHEMBL797513)
IC50 13600±n/a nM
Citation Smith, RHJorgensen, WLTirado-Rives, JLamb, MLJanssen, PAMichejda, CJKroeger Smith, MB Prediction of binding affinities for TIBO inhibitors of HIV-1 reverse transcriptase using Monte Carlo simulations in a linear response method. J Med Chem41:5272-86 (1999) 
 
Reverse transcriptase/RNaseH
Name:Reverse transcriptase/RNaseH
Type:PROTEIN
Mol. Mass.:65229.15
Organism:Human immunodeficiency virus 1
Description:ChEMBL_1473730
Residue:566
BDBM50036599
NameBDBM50036599
Synonyms:(S)-5,8-Dimethyl-7-(3-methyl-but-2-enyl)-6,7,8,9-tetrahydro-2H-2,7,9a-triaza-benzo[cd]azulene-1-thione CHEMBL59279
TypeSmall organic molecule
Emp. Form.C17H23N3S
Mol. Mass.301.45
SMILESC[C@H]1Cn2c3c(CN1CC=C(C)C)c(C)ccc3[nH]c2=S