Reaction Details
TargetDihydrofolate reductase
LigandBDBM50068812
Substrate/Competitorn/a
Meas. Tech.ChEMBL_54279 (CHEMBL669872)
Ki 0.000±n/a nM
Citation Rosowsky, AWright, JEVaidya, CMBader, HForsch, RAMota, CEPardo, JChen, CSChen, YN Synthesis and potent antifolate activity and cytotoxicity of B-ring deaza analogues of the nonpolyglutamatable dihydrofolate reductase inhibitor Nalpha-(4-amino-4-deoxypteroyl)-Ndelta-hemiphthaloyl- L-ornithine (PT523). J Med Chem41:5310-9 (1999) 
 
Dihydrofolate reductase
Name:Dihydrofolate reductase
Type:Enzyme
Mol. Mass.:21453.99
Organism:Homo sapiens (Human)
Description:Recombinant human DHFR.
Residue:187
BDBM50068812
NameBDBM50068812
Synonyms:CHEMBL146917 | N-(4-Carboxy-4-{4-[(2,4-diamino-5-chloro-quinazolin-6-ylmethyl)-amino]-benzoylamino}-butyl)-phthalamic acid
TypeSmall organic molecule
Emp. Form.C29H28ClN7O6
Mol. Mass.606.029
SMILESNc1nc(N)c2c(Cl)c(CNc3ccc(cc3)C(=O)NC(CCCNC(=O)c3ccccc3C(O)=O)C(O)=O)ccc2n1