Reaction Details
TargetSteroid 17-alpha-hydroxylase/17,20 lyase
LigandBDBM50072798
Substrate/Competitorn/a
Meas. Tech.ChEMBL_158899 (CHEMBL760886)
IC50 74±n/a nM
Citation Jarman, MBarrie, SELlera, JM The 16,17-double bond is needed for irreversible inhibition of human cytochrome p45017alpha by abiraterone (17-(3-pyridyl)androsta-5, 16-dien-3beta-ol) and related steroidal inhibitors. J Med Chem41:5375-81 (1999) 
 
Steroid 17-alpha-hydroxylase/17,20 lyase
Name:Steroid 17-alpha-hydroxylase/17,20 lyase
Type:Enzyme
Mol. Mass.:57382.42
Organism:Homo sapiens (Human)
Description:E.coli expressing human CYP17
Residue:508
BDBM50072798
NameBDBM50072798
Synonyms:(3S,5S,10S,13S,17S)-10,13-Dimethyl-17-pyridin-3-yl-hexadecahydro-cyclopenta[a]phenanthren-3-ol | CHEMBL3137965
TypeSmall organic molecule
Emp. Form.C24H35NO
Mol. Mass.353.5408
SMILES[H][C@@]1(CC[C@@]2([H])[C@]3([H])CC[C@@]4([H])C[C@@H](O)CC[C@]4(C)[C@@]3([H])CC[C@]12C)c1cccnc1