Reaction Details
TargetProgesterone receptor
LigandBDBM50062440
Substrate/Competitorn/a
Meas. Tech.ChEMBL_159052 (CHEMBL760814)
EC50 15±n/a nM
Citation Edwards, JPWest, SJMarschke, KBMais, DEGottardis, MMJones, TK 5-Aryl-1,2-dihydro-5H-chromeno[3,4-f]quinolines as potent, orally active, nonsteroidal progesterone receptor agonists: the effect of D-ring substituents. J Med Chem41:303-10 (1998) 
 
Progesterone receptor
Name:Progesterone receptor
Type:Protein
Mol. Mass.:98979.52
Organism:Homo sapiens (Human)
Description:P06401
Residue:933
BDBM50062440
NameBDBM50062440
Synonyms:9-Fluoro-5-(4-fluoro-3-methyl-phenyl)-2,2,4-trimethyl-2,5-dihydro-1H-6-oxa-1-aza-chrysene | CHEMBL320632
TypeSmall organic molecule
Emp. Form.C26H23F2NO
Mol. Mass.403.4637
SMILESCC1=CC(C)(C)Nc2ccc3-c4cc(F)ccc4OC(c4ccc(F)c(C)c4)c3c12