Reaction Details
TargetProgesterone receptor
LigandBDBM50062436
Substrate/Competitorn/a
Meas. Tech.ChEMBL_159558 (CHEMBL765846)
Ki 0.78±n/a nM
Citation Edwards, JPWest, SJMarschke, KBMais, DEGottardis, MMJones, TK 5-Aryl-1,2-dihydro-5H-chromeno[3,4-f]quinolines as potent, orally active, nonsteroidal progesterone receptor agonists: the effect of D-ring substituents. J Med Chem41:303-10 (1998) 
 
Progesterone receptor
Name:Progesterone receptor
Type:Protein
Mol. Mass.:98979.52
Organism:Homo sapiens (Human)
Description:P06401
Residue:933
BDBM50062436
NameBDBM50062436
Synonyms:9-Fluoro-2,2,4-trimethyl-5-(3-trifluoromethyl-phenyl)-2,5-dihydro-1H-6-oxa-1-aza-chrysene | CHEMBL418990
TypeSmall organic molecule
Emp. Form.C26H21F4NO
Mol. Mass.439.4447
SMILESCC1=CC(C)(C)Nc2ccc3-c4cc(F)ccc4OC(c4cccc(c4)C(F)(F)F)c3c12