Reaction Details
TargetProgesterone receptor
LigandBDBM50062426
Substrate/Competitorn/a
Meas. Tech.ChEMBL_159052 (CHEMBL760814)
EC50 3.1±n/a nM
Citation Edwards, JPWest, SJMarschke, KBMais, DEGottardis, MMJones, TK 5-Aryl-1,2-dihydro-5H-chromeno[3,4-f]quinolines as potent, orally active, nonsteroidal progesterone receptor agonists: the effect of D-ring substituents. J Med Chem41:303-10 (1998) 
 
Progesterone receptor
Name:Progesterone receptor
Type:Protein
Mol. Mass.:98979.52
Organism:Homo sapiens (Human)
Description:P06401
Residue:933
BDBM50062426
NameBDBM50062426
Synonyms:5-(4-Chloro-phenyl)-9-methoxy-2,2,4-trimethyl-2,5-dihydro-1H-6-oxa-1-aza-chrysene | CHEMBL107998
TypeSmall organic molecule
Emp. Form.C26H24ClNO2
Mol. Mass.417.927
SMILESCOc1ccc2OC(c3ccc(Cl)cc3)c3c(ccc4NC(C)(C)C=C(C)c34)-c2c1