Reaction Details
TargetProgesterone receptor
LigandBDBM50062444
Substrate/Competitorn/a
Meas. Tech.ChEMBL_159052 (CHEMBL760814)
EC50 3.7±n/a nM
Citation Edwards, JPWest, SJMarschke, KBMais, DEGottardis, MMJones, TK 5-Aryl-1,2-dihydro-5H-chromeno[3,4-f]quinolines as potent, orally active, nonsteroidal progesterone receptor agonists: the effect of D-ring substituents. J Med Chem41:303-10 (1998) 
 
Progesterone receptor
Name:Progesterone receptor
Type:Protein
Mol. Mass.:98979.52
Organism:Homo sapiens (Human)
Description:P06401
Residue:933
BDBM50062444
NameBDBM50062444
Synonyms:9-Chloro-5-(3-fluoro-phenyl)-2,2,4-trimethyl-2,5-dihydro-1H-6-oxa-1-aza-chrysene | CHEMBL322485
TypeSmall organic molecule
Emp. Form.C25H21ClFNO
Mol. Mass.405.892
SMILESCC1=CC(C)(C)Nc2ccc3-c4cc(Cl)ccc4OC(c4cccc(F)c4)c3c12