Reaction Details
TargetProgesterone receptor
LigandBDBM50062445
Substrate/Competitorn/a
Meas. Tech.ChEMBL_159052 (CHEMBL760814)
EC50 5.2±n/a nM
Citation Edwards, JPWest, SJMarschke, KBMais, DEGottardis, MMJones, TK 5-Aryl-1,2-dihydro-5H-chromeno[3,4-f]quinolines as potent, orally active, nonsteroidal progesterone receptor agonists: the effect of D-ring substituents. J Med Chem41:303-10 (1998) 
 
Progesterone receptor
Name:Progesterone receptor
Type:Protein
Mol. Mass.:98979.52
Organism:Homo sapiens (Human)
Description:P06401
Residue:933
BDBM50062445
NameBDBM50062445
Synonyms:5-(4-Bromo-phenyl)-9-chloro-2,2,4-trimethyl-2,5-dihydro-1H-6-oxa-1-aza-chrysene | CHEMBL322576
TypeSmall organic molecule
Emp. Form.C25H21BrClNO
Mol. Mass.466.797
SMILESCC1=CC(C)(C)Nc2ccc3-c4cc(Cl)ccc4OC(c4ccc(Br)cc4)c3c12