Reaction Details
TargetLysosomal Pro-X carboxypeptidase
LigandBDBM73402
Substrate/Competitorn/a
Meas. Tech.ChEMBL_154092 (CHEMBL760615)
Ki 26±n/a nM
Citation Moriarty, RMEnache, LAZhao, LGilardi, RMattson, MVPrakash, O Rigid phencyclidine analogues. Binding to the phencyclidine and sigma 1 receptors. J Med Chem41:468-77 (1998) 
 
Lysosomal Pro-X carboxypeptidase
Name:Lysosomal Pro-X carboxypeptidase
Type:Enzyme
Mol. Mass.:55805.19
Organism:Homo sapiens (Human)
Description:P42785
Residue:496
BDBM73402
NameBDBM73402
Synonyms:1-Phenyl-cyclopentanecarboxylic acid 2-diethylamino-ethyl ester 1-phenylcyclopentanecarboxylic acid 2-(diethylamino)ethyl ester;hydrochloride 2-(diethylamino)ethyl 1-phenylcyclopentanecarboxylate hydrochloride CHEMBL61946 SMR000140237 | cid_67173
TypeSmall organic molecule
Emp. Form.C18H27NO2
Mol. Mass.289.4125
SMILESCCN(CC)CCOC(=O)C1(CCCC1)c1ccccc1