Reaction Details
TargetInosine-5'-monophosphate dehydrogenase 2
LigandBDBM19264
Substrate/Competitorn/a
Meas. Tech.ChEMBL_89938 (CHEMBL699564)
Ki 6±n/a nM
Citation Lesiak, KWatanabe, KAMajumdar, APowell, JSeidman, MVanderveen, KGoldstein, BMPankiewicz, KW Synthesis of a methylenebis(phosphonate) analogue of mycophenolic adenine dinucleotide: a glucuronidation-resistant MAD analogue of NAD. J Med Chem41:618-22 (1998) 
 
Inosine-5'-monophosphate dehydrogenase 2
Name:Inosine-5'-monophosphate dehydrogenase 2
Type:Enzyme
Mol. Mass.:55806.87
Organism:Homo sapiens (Human)
Description:Recombinant IMPDH2 expressed in E. coli.
Residue:514
BDBM19264
NameBDBM19264
Synonyms:(4E)-6-(4-hydroxy-6-methoxy-7-methyl-3-oxo-1,3-dihydro-2-benzofuran-5-yl)-4-methylhex-4-enoic acid CHEMBL866 Mycophenolic Acid (MPA) | Myfortic
TypeSmall organic molecule
Emp. Form.C17H20O6
Mol. Mass.320.3371
SMILESCOc1c(C)c2COC(=O)c2c(O)c1C\C=C(/C)CCC(O)=O