Reaction Details
TargetAndrogen receptor
LigandBDBM50094569
Substrate/Competitorn/a
Meas. Tech.ChEMBL_36279 (CHEMBL651953)
Ki 14±n/a nM
Citation Hamann, LGHiguchi, RIZhi, LEdwards, JPWang, XNMarschke, KBKong, JWFarmer, LJJones, TK Synthesis and biological activity of a novel series of nonsteroidal, peripherally selective androgen receptor antagonists derived from 1,2-dihydropyridono[5,6-g]quinolines. J Med Chem41:623-39 (1998) 
 
Androgen receptor
Name:Androgen receptor
Type:Receptor
Mol. Mass.:99185.27
Organism:Homo sapiens (Human)
Description:CHO cells were stably transfected with human AR gene.
Residue:920
BDBM50094569
NameBDBM50094569
Synonyms:6-chloro-3,20-dioxo-1beta,2beta-dihydro-3'H-cyclopropa[1,2]pregna-4,6-dien-17-yl acetate Cyproterone 17-O-acetate cyproterone acetate
TypeSmall organic molecule
Emp. Form.C24H29ClO4
Mol. Mass.416.938
SMILESCC(=O)O[C@@]1(CC[C@H]2[C@@H]3C=C(Cl)C4=CC(=O)[C@@H]5C[C@@H]5[C@]4(C)[C@H]3CC[C@]12C)C(C)=O