Reaction Details
TargetBifunctional dihydrofolate reductase-thymidylate synthase
LigandBDBM50064020
Substrate/Competitorn/a
Meas. Tech.ChEMBL_209306 (CHEMBL811761)
Ki 1.1±n/a nM
Citation McKie, JHDouglas, KTChan, CRoser, SAYates, RRead, MHyde, JEDascombe, MJYuthavong, YSirawaraporn, W Rational drug design approach for overcoming drug resistance: application to pyrimethamine resistance in malaria. J Med Chem41:1367-70 (1998) 
 
Bifunctional dihydrofolate reductase-thymidylate synthase
Name:Bifunctional dihydrofolate reductase-thymidylate synthase
Type:Enzyme
Mol. Mass.:71822.51
Organism:Plasmodium falciparum (isolate K1 / Thailand)
Description:The mutant clone was prepared by cassette mutagenesis using wildtype pfDHFR as a template, and expressed in E. coli.
Residue:608
BDBM50064020
NameBDBM50064020
Synonyms:6-Ethyl-5-(3-methoxy-phenyl)-pyrimidine-2,4-diamine | CHEMBL29773
TypeSmall organic molecule
Emp. Form.C13H16N4O
Mol. Mass.244.2923
SMILESCCc1nc(N)nc(N)c1-c1cccc(OC)c1