Reaction Details
TargetBifunctional dihydrofolate reductase-thymidylate synthase
LigandBDBM18792
Substrate/Competitorn/a
Meas. Tech.ChEMBL_209304 (CHEMBL811759)
Ki 82±n/a nM
Citation McKie, JHDouglas, KTChan, CRoser, SAYates, RRead, MHyde, JEDascombe, MJYuthavong, YSirawaraporn, W Rational drug design approach for overcoming drug resistance: application to pyrimethamine resistance in malaria. J Med Chem41:1367-70 (1998) 
 
Bifunctional dihydrofolate reductase-thymidylate synthase
Name:Bifunctional dihydrofolate reductase-thymidylate synthase
Type:Enzyme
Mol. Mass.:71822.51
Organism:Plasmodium falciparum (isolate K1 / Thailand)
Description:The mutant clone was prepared by cassette mutagenesis using wildtype pfDHFR as a template, and expressed in E. coli.
Residue:608
BDBM18792
NameBDBM18792
Synonyms:1-(4-chlorophenyl)-6,6-dimethyl-1,6-dihydro-1,3,5-triazine-2,4-diamine Chlorazin | Cycloguanil
TypeSmall organic molecule
Emp. Form.C11H14ClN5
Mol. Mass.251.715
SMILESCC1(C)N=C(N)N=C(N)N1c1ccc(Cl)cc1