Reaction Details
TargetCarbonic anhydrase 2
LigandBDBM10863
Substrate/Competitorn/a
Meas. Tech.ChEMBL_45078 (CHEMBL657149)
Ki 110±n/a nM
Citation Scozzafava, AMenabuoni, LMincione, FBriganti, FMincione, GSupuran, CT Carbonic anhydrase inhibitors. Synthesis of water-soluble, topically effective, intraocular pressure-lowering aromatic/heterocyclic sulfonamides containing cationic or anionic moieties: is the tail more important than the ring? J Med Chem42:2641-50 (1999) 
 
Carbonic anhydrase 2
Name:Carbonic anhydrase 2
Type:Enzyme
Mol. Mass.:29250.71
Organism:Homo sapiens (Human)
Description:P00918
Residue:260
BDBM10863
NameBDBM10863
Synonyms:4-Amino-3-chlorobenzenesulfonamide CHEMBL7092 halogenosulfanilamide deriv. 5c
TypeSmall organic molecule
Emp. Form.C6H7ClN2O2S
Mol. Mass.206.65
SMILESNc1ccc(cc1Cl)S(N)(=O)=O