Reaction Details
TargetCoagulation factor X
LigandBDBM50079217
Substrate/Competitorn/a
Meas. Tech.ChEMBL_49168 (CHEMBL663267)
Ki 53±n/a nM
Citation Quan, MLLiauw, AYEllis, CDPruitt, JRCarini, DJBostrom, LLHuang, PPHarrison, KKnabb, RMThoolen, MJWong, PCWexler, RR Design and synthesis of isoxazoline derivatives as factor Xa inhibitors. 1. J Med Chem42:2752-9 (1999) 
 
Coagulation factor X
Name:Coagulation factor X
Type:Enzyme
Mol. Mass.:54726.60
Organism:Homo sapiens (Human)
Description:n/a
Residue:488
BDBM50079217
NameBDBM50079217
Synonyms:4'-{[3-(3-Carbamimidoyl-phenyl)-5-methoxycarbonylmethyl-4,5-dihydro-isoxazole-5-carbonyl]-amino}-biphenyl-2-carboxylic acid methyl ester; TFA | CHEMBL329568
TypeSmall organic molecule
Emp. Form.C28H26N4O6
Mol. Mass.514.5292
SMILESCOC(=O)CC1(CC(=NO1)c1cccc(c1)C(N)=N)C(=O)Nc1ccc(cc1)-c1ccccc1C(=O)OC