Reaction Details
TargetCoagulation factor X
LigandBDBM50079210
Substrate/Competitorn/a
Meas. Tech.ChEMBL_49168 (CHEMBL663267)
Ki 28±n/a nM
Citation Quan, MLLiauw, AYEllis, CDPruitt, JRCarini, DJBostrom, LLHuang, PPHarrison, KKnabb, RMThoolen, MJWong, PCWexler, RR Design and synthesis of isoxazoline derivatives as factor Xa inhibitors. 1. J Med Chem42:2752-9 (1999) 
 
Coagulation factor X
Name:Coagulation factor X
Type:Enzyme
Mol. Mass.:54726.60
Organism:Homo sapiens (Human)
Description:n/a
Residue:488
BDBM50079210
NameBDBM50079210
Synonyms:CHEMBL319206 | [3-(3-Carbamimidoyl-phenyl)-5-(2'-trifluoromethyl-biphenyl-4-ylcarbamoyl)-4,5-dihydro-isoxazol-5-yl]-acetic acid methyl ester; TFA
TypeSmall organic molecule
Emp. Form.C27H23F3N4O4
Mol. Mass.524.4911
SMILESCOC(=O)CC1(CC(=NO1)c1cccc(c1)C(N)=N)C(=O)Nc1ccc(cc1)-c1ccccc1C(F)(F)F