Reaction Details
TargetProthrombin
LigandBDBM50037996
Substrate/Competitorn/a
Meas. Tech.ChEMBL_208915 (CHEMBL814970)
Ki 6±n/a nM
Citation Mason, JSMorize, IMenard, PRCheney, DLHulme, CLabaudiniere, RF New 4-point pharmacophore method for molecular similarity and diversity applications: overview of the method and applications, including a novel approach to the design of combinatorial libraries containing privileged substructures. J Med Chem42:3251-64 (1999) 
 
Prothrombin
Name:Prothrombin
Type:Protein
Mol. Mass.:70029.57
Organism:Homo sapiens (Human)
Description:P00734
Residue:622
BDBM50037996
NameBDBM50037996
Synonyms:1-[N-(naphthalen-2-ylsulfonyl)glycyl-4-carbamimidoyl-D-phenylalanyl]piperidine N-[(R)-1-(4-Carbamimidoyl-benzyl)-2-oxo-2-piperidin-1-yl-ethyl]-2-(naphthalene-2-sulfonylamino)-acetamide N-[1-(4-Carbamimidoyl-benzyl)-2-oxo-2-piperidin-1-yl-ethyl]-2-(naphthalene-2-sulfonylamino)-acetamide | N-[1-(4-Carbamimidoyl-benzyl)-2-oxo-2-piperidin-1-yl-ethyl]-2-(naphthalene-2-sulfonylamino)-acetamide(NAPAP)
TypeSmall organic molecule
Emp. Form.C27H31N5O4S
Mol. Mass.521.631
SMILESNC(=N)c1ccc(C[C@@H](NC(=O)CNS(=O)(=O)c2ccc3ccccc3c2)C(=O)N2CCCCC2)cc1