Reaction Details
TargetCoagulation factor X
LigandBDBM50080477
Substrate/Competitorn/a
Meas. Tech.ChEMBL_49328 (CHEMBL660846)
Ki 80±n/a nM
Citation Mason, JSMorize, IMenard, PRCheney, DLHulme, CLabaudiniere, RF New 4-point pharmacophore method for molecular similarity and diversity applications: overview of the method and applications, including a novel approach to the design of combinatorial libraries containing privileged substructures. J Med Chem42:3251-64 (1999) 
 
Coagulation factor X
Name:Coagulation factor X
Type:Enzyme
Mol. Mass.:54726.60
Organism:Homo sapiens (Human)
Description:n/a
Residue:488
BDBM50080477
NameBDBM50080477
Synonyms:3-[(S)-3-(Naphthalene-2-sulfonylamino)-2-oxo-pyrrolidin-1-ylmethyl]-benzamidine CHEMBL93796 | RPR-118071
TypeSmall organic molecule
Emp. Form.C22H22N4O3S
Mol. Mass.422.5
SMILESNC(=N)c1cccc(CN2CC[C@H](NS(=O)(=O)c3ccc4ccccc4c3)C2=O)c1