Reaction Details
TargetCarbonic anhydrase 2
LigandBDBM50080640
Substrate/Competitorn/a
Meas. Tech.ChEMBL_45082 (CHEMBL657153)
Ki 1.5±n/a nM
Citation Scozzafava, ABriganti, FMincione, GMenabuoni, LMincione, FSupuran, CT Carbonic anhydrase inhibitors: synthesis of water-soluble, aminoacyl/dipeptidyl sulfonamides possessing long-lasting intraocular pressure-lowering properties via the topical route. J Med Chem42:3690-700 (1999) 
 
Carbonic anhydrase 2
Name:Carbonic anhydrase 2
Type:Enzyme
Mol. Mass.:29250.71
Organism:Homo sapiens (Human)
Description:P00918
Residue:260
BDBM50080640
NameBDBM50080640
Synonyms:2-Methylamino-N-[4-(5-sulfamoyl-[1,3,4]thiadiazol-2-ylsulfamoyl)-phenyl]-acetamide | CHEMBL122786
TypeSmall organic molecule
Emp. Form.C11H14N6O5S3
Mol. Mass.406.461
SMILESCNCC(=O)Nc1ccc(cc1)S(=O)(=O)Nc1nnc(s1)S(N)(=O)=O