Reaction Details
TargetCarbonic anhydrase 2
LigandBDBM50080698
Substrate/Competitorn/a
Meas. Tech.ChEMBL_45082 (CHEMBL657153)
Ki 1.8±n/a nM
Citation Scozzafava, ABriganti, FMincione, GMenabuoni, LMincione, FSupuran, CT Carbonic anhydrase inhibitors: synthesis of water-soluble, aminoacyl/dipeptidyl sulfonamides possessing long-lasting intraocular pressure-lowering properties via the topical route. J Med Chem42:3690-700 (1999) 
 
Carbonic anhydrase 2
Name:Carbonic anhydrase 2
Type:Enzyme
Mol. Mass.:29250.71
Organism:Homo sapiens (Human)
Description:P00918
Residue:260
BDBM50080698
NameBDBM50080698
Synonyms:2-Methylamino-N-{4-[3-methyl-5-sulfamoyl-3H-[1,3,4]thiadiazol-(2Z)-ylidenesulfamoyl]-phenyl}-acetamide | CHEMBL123606
TypeSmall organic molecule
Emp. Form.C12H16N6O5S3
Mol. Mass.420.488
SMILESCNCC(=O)Nc1ccc(cc1)S(=O)(=O)\N=c1/sc(nn1C)S(N)(=O)=O