Reaction Details
TargetCarbonic anhydrase 2
LigandBDBM50080684
Substrate/Competitorn/a
Meas. Tech.ChEMBL_45082 (CHEMBL657153)
Ki 0.60±n/a nM
Citation Scozzafava, ABriganti, FMincione, GMenabuoni, LMincione, FSupuran, CT Carbonic anhydrase inhibitors: synthesis of water-soluble, aminoacyl/dipeptidyl sulfonamides possessing long-lasting intraocular pressure-lowering properties via the topical route. J Med Chem42:3690-700 (1999) 
 
Carbonic anhydrase 2
Name:Carbonic anhydrase 2
Type:Enzyme
Mol. Mass.:29250.71
Organism:Homo sapiens (Human)
Description:P00918
Residue:260
BDBM50080684
NameBDBM50080684
Synonyms:5-(4-aminophenylsulfonylimino)-4-methyl-4,5-dihydro-1,3,4-thiadiazole-2-sulfonamide CHEMBL331083
TypeSmall organic molecule
Emp. Form.C9H11N5O4S3
Mol. Mass.349.41
SMILESCn1nc(s\c1=N/S(=O)(=O)c1ccc(N)cc1)S(N)(=O)=O