Reaction Details
TargetCarbonic anhydrase 2
LigandBDBM10870
Substrate/Competitorn/a
Meas. Tech.ChEMBL_45082 (CHEMBL657153)
Ki 2±n/a nM
Citation Scozzafava, ABriganti, FMincione, GMenabuoni, LMincione, FSupuran, CT Carbonic anhydrase inhibitors: synthesis of water-soluble, aminoacyl/dipeptidyl sulfonamides possessing long-lasting intraocular pressure-lowering properties via the topical route. J Med Chem42:3690-700 (1999) 
 
Carbonic anhydrase 2
Name:Carbonic anhydrase 2
Type:Enzyme
Mol. Mass.:29250.71
Organism:Homo sapiens (Human)
Description:P00918
Residue:260
BDBM10870
NameBDBM10870
Synonyms:2-N-(4-aminobenzene)-1,3,4-thiadiazole-2,5-disulfonamide CHEMBL268439 aminobenzolamide deriv. 43 | aromatic/heteroaromatic sulfonamide 15
TypeSmall organic molecule
Emp. Form.C8H9N5O4S3
Mol. Mass.335.383
SMILESNc1ccc(cc1)S(=O)(=O)Nc1nnc(s1)S(N)(=O)=O