Reaction Details
TargetC-X-C chemokine receptor type 4
LigandBDBM50081406
Substrate/Competitorn/a
Meas. Tech.ChEMBL_44679 (CHEMBL884098)
IC50 67±n/a nM
Citation Bridger, GJSkerlj, RTPadmanabhan, SMartellucci, SAHenson, GWStruyf, SWitvrouw, MSchols, DDe Clercq, E Synthesis and structure-activity relationships of phenylenebis(methylene)-linked bis-azamacrocycles that inhibit HIV-1 and HIV-2 replication by antagonism of the chemokine receptor CXCR4. J Med Chem42:3971-81 (1999) C-X-C chemokine receptor type 4
Name:C-X-C chemokine receptor type 4
Type:Enzyme
Mol. Mass.:39754.61
Organism:Homo sapiens (Human)
Description:P61073
Residue:352
BDBM50081406
NameBDBM50081406
Synonyms:1,5,8,11-tetraazacyclotetradecanyl[4-(1,5,8,11-tetraazacyclotetradecanylmethyl)phenyl]methane;octahydrobromide;dihydrate | CHEMBL543895
TypeSmall organic molecule
Emp. Form.C28H54N8
Mol. Mass.502.782
SMILESC(N1CCCNCCNCCNCCC1)c1ccc(CN2CCCNCCNCCNCCC2)cc1