Reaction Details
TargetB2 bradykinin receptor
LigandBDBM50081659
Substrate/Competitorn/a
Meas. Tech.ChEMBL_40426 (CHEMBL652641)
Ki 0.07±n/a nM
Citation Amblard, MDaffix, IBergé, GCalmès, MDodey, PPruneau, DPaquet, JLLuccarini, JMBélichard, PMartinez, J Synthesis and characterization of bradykinin B(2) receptor agonists containing constrained dipeptide mimics. J Med Chem42:4193-201 (1999) B2 bradykinin receptor
Name:B2 bradykinin receptor
Type:Enzyme Catalytic Domain
Mol. Mass.:44467.17
Organism:Homo sapiens (Human)
Description:B2 BRADYKININ BDKRB2 HUMAN::P30411
Residue:391
BDBM50081659
NameBDBM50081659
Synonyms:(3-(Ser-Thi-Gly-Hyp-Pro-Arg-Lys-H)-4-oxo-3,4-dihydro-2H-benzo[b][1,4]thiazepin-5-yl)-acetyl-(Arg-OH) | CHEMBL440257
TypeSmall organic molecule
Emp. Form.C51H77N17O13S2
Mol. Mass.1200.393
SMILESNCCCC[C@H](N)C(=O)N[C@@H](CCCNC(N)=N)C(=O)N1CCC[C@H]1C(=O)N1CC(O)C[C@H]1C(=O)NCC(=O)N[C@@H](Cc1cccs1)C(=O)N[C@@H](CO)C(=O)NC1CSc2ccccc2N(CC(=O)N[C@H](CCCNC(N)=N)C(O)=O)C1=O