Reaction Details
TargetMu-type opioid receptor
LigandBDBM50081925
Substrate/Competitorn/a
Meas. Tech.ChEMBL_148704 (CHEMBL751710)
IC50 20±n/a nM
Citation Borg, SVollinga, RCLabarre, MPayza, KTerenius, LLuthman, K Design, synthesis, and evaluation of Phe-Gly mimetics: heterocyclic building blocks for pseudopeptides. J Med Chem42:4331-42 (1999) Mu-type opioid receptor
Name:Mu-type opioid receptor
Type:G Protein-Coupled Receptor (GPCR)
Mol. Mass.:44503.11
Organism:Rattus norvegicus (rat)
Description:Competition binding assays were carried out using membrane preparations from transfected HN9.10 cells that constitutively expressed the mu opioid receptor.
Residue:398
BDBM50081925
NameBDBM50081925
Synonyms:(S)-1-[(S)-2-[5-((S)-1-{(R)-2-[(S)-2-Amino-3-(4-hydroxy-phenyl)-propionylamino]-propionylamino}-2-phenyl-ethyl)-[1,3,4]oxadiazol-2-ylamino]-3-(4-hydroxy-phenyl)-propionyl]-pyrrolidine-2-carboxylic acid ((S)-1-carbamoyl-2-hydroxy-ethyl)-amide | CHEMBL135087
TypeSmall organic molecule
Emp. Form.C39H47N9O9
Mol. Mass.785.8454
SMILESC[C@@H](NC(=O)[C@@H](N)Cc1ccc(O)cc1)C(=O)N[C@@H](Cc1ccccc1)c1nnc(N[C@@H](Cc2ccc(O)cc2)C(=O)N2CCC[C@H]2C(=O)N[C@@H](CO)C(N)=O)o1