Reaction Details
TargetSubstance-P receptor
LigandBDBM50081929
Substrate/Competitorn/a
Meas. Tech.ChEMBL_143041 (CHEMBL750290)
IC50>1000±n/a nM
Citation Borg, SVollinga, RCLabarre, MPayza, KTerenius, LLuthman, K Design, synthesis, and evaluation of Phe-Gly mimetics: heterocyclic building blocks for pseudopeptides. J Med Chem42:4331-42 (1999) Substance-P receptor
Name:Substance-P receptor
Type:G Protein-Coupled Receptor (GPCR)
Mol. Mass.:46371.54
Organism:Rattus norvegicus (rat)
Description:Competition binding assays were carried out using membrane preparations from transfected CHO cells that constitutively expressed the rat NK1 receptor.
Residue:407
BDBM50081929
NameBDBM50081929
Synonyms:(S)-1-[(S)-2-{[5-((S)-1-{(R)-2-[(S)-2-Amino-3-(4-hydroxy-phenyl)-propionylamino]-propionylamino}-2-phenyl-ethyl)-1H-[1,2,4]triazol-3-ylmethyl]-amino}-3-(4-hydroxy-phenyl)-propionyl]-pyrrolidine-2-carboxylic acid ((S)-1-carbamoyl-2-hydroxy-ethyl)-amide | CHEMBL341966
TypeSmall organic molecule
Emp. Form.C40H50N10O8
Mol. Mass.798.8872
SMILESC[C@@H](NC(=O)[C@@H](N)Cc1ccc(O)cc1)C(=O)N[C@@H](Cc1ccccc1)c1nnc(CN[C@@H](Cc2ccc(O)cc2)C(=O)N2CCC[C@H]2C(=O)N[C@@H](CO)C(N)=O)[nH]1