Reaction Details
TargetMu-type opioid receptor
LigandBDBM50081929
Substrate/Competitorn/a
Meas. Tech.ChEMBL_148704 (CHEMBL751710)
IC50 21±n/a nM
Citation Borg, SVollinga, RCLabarre, MPayza, KTerenius, LLuthman, K Design, synthesis, and evaluation of Phe-Gly mimetics: heterocyclic building blocks for pseudopeptides. J Med Chem42:4331-42 (1999) Mu-type opioid receptor
Name:Mu-type opioid receptor
Type:G Protein-Coupled Receptor (GPCR)
Mol. Mass.:44503.11
Organism:Rattus norvegicus (rat)
Description:Competition binding assays were carried out using membrane preparations from transfected HN9.10 cells that constitutively expressed the mu opioid receptor.
Residue:398
BDBM50081929
NameBDBM50081929
Synonyms:(S)-1-[(S)-2-{[5-((S)-1-{(R)-2-[(S)-2-Amino-3-(4-hydroxy-phenyl)-propionylamino]-propionylamino}-2-phenyl-ethyl)-1H-[1,2,4]triazol-3-ylmethyl]-amino}-3-(4-hydroxy-phenyl)-propionyl]-pyrrolidine-2-carboxylic acid ((S)-1-carbamoyl-2-hydroxy-ethyl)-amide | CHEMBL341966
TypeSmall organic molecule
Emp. Form.C40H50N10O8
Mol. Mass.798.8872
SMILESC[C@@H](NC(=O)[C@@H](N)Cc1ccc(O)cc1)C(=O)N[C@@H](Cc1ccccc1)c1nnc(CN[C@@H](Cc2ccc(O)cc2)C(=O)N2CCC[C@H]2C(=O)N[C@@H](CO)C(N)=O)[nH]1