Reaction Details
TargetC-C chemokine receptor type 1
LigandBDBM50027216
Substrate/Competitorn/a
Meas. Tech.ChEMBL_79549 (CHEMBL691179)
IC50 2500±n/a nM
Citation Ng, HPMay, KBauman, JGGhannam, AIslam, ILiang, MHoruk, RHesselgesser, JSnider, RMPerez, HDMorrissey, MM Discovery of novel non-peptide CCR1 receptor antagonists. J Med Chem42:4680-94 (1999) C-C chemokine receptor type 1
Name:C-C chemokine receptor type 1
Type:Enzyme
Mol. Mass.:41180.69
Organism:Homo sapiens (Human)
Description:P32246
Residue:355
BDBM50027216
NameBDBM50027216
Synonyms:5-(4-(4-chlorophenyl)-4-hydroxy-piperidin-1-yl)-2,2-diphenylpentanenitrile CHEMBL34166 | VUF-2274
TypeSmall organic molecule
Emp. Form.C28H29ClN2O
Mol. Mass.444.996
SMILESOC1(CCN(CCCC(C#N)(c2ccccc2)c2ccccc2)CC1)c1ccc(Cl)cc1