Reaction Details
Target5-hydroxytryptamine receptor 1A
LigandBDBM50083307
Substrate/Competitorn/a
Meas. Tech.ChEMBL_1432 (CHEMBL616306)
Ki 0.70±n/a nM
Citation Abou-Gharbia, MAChilders, WEFletcher, HMcGaughey, GPatel, UWebb, MBYardley, JAndree, TBoast, CKucharik, RJMarquis, KMorris, HScerni, RMoyer, JA Synthesis and SAR of adatanserin: novel adamantyl aryl- and heteroarylpiperazines with dual serotonin 5-HT(1A) and 5-HT(2) activity as potential anxiolytic and antidepressant agents. J Med Chem42:5077-94 (2000) 5-hydroxytryptamine receptor 1A
Name:5-hydroxytryptamine receptor 1A
Type:G Protein-Coupled Receptor (GPCR)
Mol. Mass.:46445.29
Organism:Rattus norvegicus (rat)
Description:Binding assays were performed using rat hippocampal membranes.
Residue:422
BDBM50083307
NameBDBM50083307
Synonyms:CHEMBL544163 | Hexahydro-2,5-methano-pentalene-3a-carboxylic acid {2-[4-(3-chloro-phenyl)-piperazin-1-yl]-ethyl}-amide; dihydrochloride
TypeSmall organic molecule
Emp. Form.C22H30ClN3O
Mol. Mass.387.946
SMILESClc1cccc(c1)N1CCN(CCNC(=O)C23CC4C[C@@H]2C[C@@H](C3)C4)CC1