Reaction Details
TargetMuscarinic acetylcholine receptor M3
LigandBDBM50073464
Substrate/Competitorn/a
Meas. Tech.ChEMBL_138585 (CHEMBL746513)
IC50 349±n/a nM
Citation Augelli-Szafran, CEBlankley, CJJaen, JCMoreland, DWNelson, CBPenvose-Yi, JRSchwarz, RDThomas, AJ Identification and characterization of m1 selective muscarinic receptor antagonists1. J Med Chem42:356-63 (1999) 
 
Muscarinic acetylcholine receptor M3
Name:Muscarinic acetylcholine receptor M3
Type:Enzyme
Mol. Mass.:66151.03
Organism:Homo sapiens (Human)
Description:P20309
Residue:590
BDBM50073464
NameBDBM50073464
Synonyms:1-Ethyl-4-phenyl-1,2,5,6-tetrahydro-pyridine-3-carboxylic acid hexyl ester; oxalic acid | CHEMBL122354
TypeSmall organic molecule
Emp. Form.C20H29NO2
Mol. Mass.315.4498
SMILESCCCCCCOC(=O)C1=C(CCN(CC)C1)c1ccccc1