Reaction Details
TargetMuscarinic acetylcholine receptor M2
LigandBDBM50073465
Substrate/Competitorn/a
Meas. Tech.ChEMBL_139631 (CHEMBL748244)
IC50 22±n/a nM
Citation Augelli-Szafran, CEBlankley, CJJaen, JCMoreland, DWNelson, CBPenvose-Yi, JRSchwarz, RDThomas, AJ Identification and characterization of m1 selective muscarinic receptor antagonists1. J Med Chem42:356-63 (1999) 
 
Muscarinic acetylcholine receptor M2
Name:Muscarinic acetylcholine receptor M2
Type:GPCR
Mol. Mass.:51730.61
Organism:Homo sapiens (Human)
Description:P08172
Residue:466
BDBM50073465
NameBDBM50073465
Synonyms:1-Ethyl-4-phenyl-1,2,5,6-tetrahydro-pyridine-3-carboxylic acid nonyl ester | CHEMBL121059
TypeSmall organic molecule
Emp. Form.C23H35NO2
Mol. Mass.357.5295
SMILESCCCCCCCCCOC(=O)C1=C(CCN(CC)C1)c1ccccc1