Reaction Details
TargetMuscarinic acetylcholine receptor M1
LigandBDBM50073499
Substrate/Competitorn/a
Meas. Tech.ChEMBL_138287 (CHEMBL744319)
IC50 64±n/a nM
Citation Augelli-Szafran, CEBlankley, CJJaen, JCMoreland, DWNelson, CBPenvose-Yi, JRSchwarz, RDThomas, AJ Identification and characterization of m1 selective muscarinic receptor antagonists1. J Med Chem42:356-63 (1999) 
 
Muscarinic acetylcholine receptor M1
Name:Muscarinic acetylcholine receptor M1
Type:Protein
Mol. Mass.:51442.54
Organism:Homo sapiens (Human)
Description:P11229
Residue:460
BDBM50073499
NameBDBM50073499
Synonyms:1-Ethyl-4-phenyl-1,2,5,6-tetrahydro-pyridine-3-carboxylic acid pentyl ester; oxalic acid | CHEMBL340561
TypeSmall organic molecule
Emp. Form.C19H27NO2
Mol. Mass.301.4232
SMILESCCCCCOC(=O)C1=C(CCN(CC)C1)c1ccccc1