Reaction Details
TargetMuscarinic acetylcholine receptor M3
LigandBDBM50073503
Substrate/Competitorn/a
Meas. Tech.ChEMBL_138585 (CHEMBL746513)
IC50 41±n/a nM
Citation Augelli-Szafran, CEBlankley, CJJaen, JCMoreland, DWNelson, CBPenvose-Yi, JRSchwarz, RDThomas, AJ Identification and characterization of m1 selective muscarinic receptor antagonists1. J Med Chem42:356-63 (1999) 
 
Muscarinic acetylcholine receptor M3
Name:Muscarinic acetylcholine receptor M3
Type:Enzyme
Mol. Mass.:66151.03
Organism:Homo sapiens (Human)
Description:P20309
Residue:590
BDBM50073503
NameBDBM50073503
Synonyms:1-Ethyl-4-phenyl-1,2,5,6-tetrahydro-pyridine-3-carboxylic acid cyclohexyl ester; oxalic acid | CHEMBL332980
TypeSmall organic molecule
Emp. Form.C20H27NO2
Mol. Mass.313.4339
SMILESCCN1CCC(=C(C1)C(=O)OC1CCCCC1)c1ccccc1