Reaction Details
TargetMuscarinic acetylcholine receptor M5
LigandBDBM50073473
Substrate/Competitorn/a
Meas. Tech.ChEMBL_139388 (CHEMBL747701)
IC50 190±n/a nM
Citation Augelli-Szafran, CEBlankley, CJJaen, JCMoreland, DWNelson, CBPenvose-Yi, JRSchwarz, RDThomas, AJ Identification and characterization of m1 selective muscarinic receptor antagonists1. J Med Chem42:356-63 (1999) 
 
Muscarinic acetylcholine receptor M5
Name:Muscarinic acetylcholine receptor M5
Type:PROTEIN
Mol. Mass.:60102.35
Organism:Homo sapiens (Human)
Description:ChEMBL_1517990
Residue:532
BDBM50073473
NameBDBM50073473
Synonyms:1-Ethyl-4-phenyl-1,2,3,6-tetrahydro-pyridine-3-carboxylic acid 2-p-tolyl-ethyl ester; oxalic acid | CHEMBL124173
TypeSmall organic molecule
Emp. Form.C23H27NO2
Mol. Mass.349.466
SMILESCCN1CC=C(C(C1)C(=O)OCCc1ccc(C)cc1)c1ccccc1