Reaction Details
TargetMuscarinic acetylcholine receptor M2
LigandBDBM50073451
Substrate/Competitorn/a
Meas. Tech.ChEMBL_139631 (CHEMBL748244)
IC50 1865±n/a nM
Citation Augelli-Szafran, CEBlankley, CJJaen, JCMoreland, DWNelson, CBPenvose-Yi, JRSchwarz, RDThomas, AJ Identification and characterization of m1 selective muscarinic receptor antagonists1. J Med Chem42:356-63 (1999) 
 
Muscarinic acetylcholine receptor M2
Name:Muscarinic acetylcholine receptor M2
Type:GPCR
Mol. Mass.:51730.61
Organism:Homo sapiens (Human)
Description:P08172
Residue:466
BDBM50073451
NameBDBM50073451
Synonyms:1-Ethyl-4-phenyl-1,2,5,6-tetrahydro-pyridine-3-carboxylic acid butyl ester; oxalic acid | CHEMBL324712
TypeSmall organic molecule
Emp. Form.C18H25NO2
Mol. Mass.287.3966
SMILESCCCCOC(=O)C1=C(CCN(CC)C1)c1ccccc1