Reaction Details
TargetReverse transcriptase/RNaseH
LigandBDBM50074596
Substrate/Competitorn/a
Meas. Tech.ChEMBL_197263 (CHEMBL804179)
EC50 790±n/a nM
Citation Eriksson, MAPitera, JKollman, PA Prediction of the binding free energies of new TIBO-like HIV-1 reverse transcriptase inhibitors using a combination of PROFEC, PB/SA, CMC/MD, and free energy calculations. J Med Chem42:868-81 (1999) 
 
Reverse transcriptase/RNaseH
Name:Reverse transcriptase/RNaseH
Type:PROTEIN
Mol. Mass.:65229.15
Organism:Human immunodeficiency virus 1
Description:ChEMBL_1473730
Residue:566
BDBM50074596
NameBDBM50074596
Synonyms:(6R,8S)-7-Allyl-6,8-dimethyl-6,7,8,9-tetrahydro-2H-2,7,9a-triaza-benzo[cd]azulene-1-thione R-84914
TypeSmall organic molecule
Emp. Form.C15H19N3S
Mol. Mass.273.396
SMILESC[C@H]1Cn2c3c(cccc3[nH]c2=S)[C@@H](C)N1CC=C