Reaction Details
TargetReverse transcriptase/RNaseH
LigandBDBM50074598
Substrate/Competitorn/a
Meas. Tech.ChEMBL_197263 (CHEMBL804179)
EC50 4200±n/a nM
Citation Eriksson, MAPitera, JKollman, PA Prediction of the binding free energies of new TIBO-like HIV-1 reverse transcriptase inhibitors using a combination of PROFEC, PB/SA, CMC/MD, and free energy calculations. J Med Chem42:868-81 (1999) 
 
Reverse transcriptase/RNaseH
Name:Reverse transcriptase/RNaseH
Type:PROTEIN
Mol. Mass.:65229.15
Organism:Human immunodeficiency virus 1
Description:ChEMBL_1473730
Residue:566
BDBM50074598
NameBDBM50074598
Synonyms:(S)-7-Allyl-8-methyl-6,7,8,9-tetrahydro-2H-2,7,9a-triaza-benzo[cd]azulen-1-one R-80902
TypeSmall organic molecule
Emp. Form.C14H17N3O
Mol. Mass.243.3043
SMILESC[C@H]1Cn2c3c(CN1CC=C)cccc3[nH]c2=O