Reaction Details
TargetMyosin light chain kinase, smooth muscle
LigandBDBM50074639
Substrate/Competitorn/a
Meas. Tech.ChEMBL_140967 (CHEMBL745132)
IC50 200±n/a nM
Citation Lukas, TJMirzoeva, SSlomczynska, UWatterson, DM Identification of novel classes of protein kinase inhibitors using combinatorial peptide chemistry based on functional genomics knowledge. J Med Chem42:910-9 (1999) 
 
Myosin light chain kinase, smooth muscle
Name:Myosin light chain kinase, smooth muscle
Type:Enzyme
Mol. Mass.:210423.57
Organism:Gallus gallus (chicken)
Description:n/a
Residue:1906
BDBM50074639
NameBDBM50074639
Synonyms:CHEMBL404932 | R-K-K-Y-K-W-R-R-K-NH2
TypeSmall organic molecule
Emp. Form.C62H106N24O10
Mol. Mass.1347.6598
SMILESNCCCC[C@H](NC(=O)[C@H](CCCNC(N)=N)NC(=O)[C@H](CCCNC(N)=N)NC(=O)[C@H](Cc1c[nH]c2ccccc12)NC(=O)[C@H](CCCCN)NC(=O)[C@H](Cc1ccc(O)cc1)NC(=O)[C@H](CCCCN)NC(=O)[C@H](CCCCN)NC(=O)[C@@H](N)CCCNC(N)=N)C(N)=O