Reaction Details
TargetMyosin light chain kinase, smooth muscle
LigandBDBM50074637
Substrate/Competitorn/a
Meas. Tech.ChEMBL_140967 (CHEMBL745132)
IC50 160±n/a nM
Citation Lukas, TJMirzoeva, SSlomczynska, UWatterson, DM Identification of novel classes of protein kinase inhibitors using combinatorial peptide chemistry based on functional genomics knowledge. J Med Chem42:910-9 (1999) 
 
Myosin light chain kinase, smooth muscle
Name:Myosin light chain kinase, smooth muscle
Type:Enzyme
Mol. Mass.:210423.57
Organism:Gallus gallus (chicken)
Description:n/a
Residue:1906
BDBM50074637
NameBDBM50074637
Synonyms:CHEMBL265891 | R-K-K-Y-K-M-R-R-K-NH2
TypeSmall organic molecule
Emp. Form.C56H105N23O10S
Mol. Mass.1292.646
SMILESCSCC[C@H](NC(=O)[C@H](CCCCN)NC(=O)[C@H](Cc1ccc(O)cc1)NC(=O)[C@H](CCCCN)NC(=O)[C@H](CCCCN)NC(=O)[C@@H](N)CCCNC(N)=N)C(=O)N[C@@H](CCCNC(N)=N)C(=O)N[C@@H](CCCNC(N)=N)C(=O)N[C@@H](CCCCN)C(N)=O