Reaction Details
TargetMyosin light chain kinase, smooth muscle
LigandBDBM50074646
Substrate/Competitorn/a
Meas. Tech.ChEMBL_140967 (CHEMBL745132)
IC50 270±n/a nM
Citation Lukas, TJMirzoeva, SSlomczynska, UWatterson, DM Identification of novel classes of protein kinase inhibitors using combinatorial peptide chemistry based on functional genomics knowledge. J Med Chem42:910-9 (1999) 
 
Myosin light chain kinase, smooth muscle
Name:Myosin light chain kinase, smooth muscle
Type:Enzyme
Mol. Mass.:210423.57
Organism:Gallus gallus (chicken)
Description:n/a
Residue:1906
BDBM50074646
NameBDBM50074646
Synonyms:CHEMBL415435 | R-K-K-Y-K-(Ach)-R-R-K-NH2
TypeSmall organic molecule
Emp. Form.C58H107N23O10
Mol. Mass.1286.6183
SMILESNCCCC[C@H](NC(=O)[C@H](CCCNC(N)=N)NC(=O)[C@H](CCCNC(N)=N)NC(=O)C1CCC(CC1)NC(=O)[C@H](CCCCN)NC(=O)[C@H](Cc1ccc(O)cc1)NC(=O)[C@H](CCCCN)NC(=O)[C@H](CCCCN)NC(=O)[C@@H](N)CCCNC(N)=N)C(N)=O