Reaction Details
TargetNeuromedin-K receptor
LigandBDBM50074792
Substrate/Competitorn/a
Meas. Tech.ChEMBL_209565 (CHEMBL811267)
Ki 14±n/a nM
Citation Giardina, GARaveglia, LFGrugni, MSarau, HMFarina, CMedhurst, ADGraziani, DSchmidt, DBRigolio, RLuttmann, MCavagnera, SFoley, JJVecchietti, VHay, DW Discovery of a novel class of selective non-peptide antagonists for the human neurokinin-3 receptor. 2. Identification of (S)-N-(1-phenylpropyl)-3-hydroxy-2-phenylquinoline-4-carboxamide (SB 223412). J Med Chem42:1053-65 (1999) 
 
Neuromedin-K receptor
Name:Neuromedin-K receptor
Type:Enzyme
Mol. Mass.:52221.96
Organism:Homo sapiens (Human)
Description:P29371
Residue:465
BDBM50074792
NameBDBM50074792
Synonyms:2-Phenyl-3-propyl-quinoline-4-carboxylic acid (1-phenyl-propyl)-amide | CHEMBL10512
TypeSmall organic molecule
Emp. Form.C28H28N2O
Mol. Mass.408.5347
SMILESCCCc1c(nc2ccccc2c1C(=O)NC(CC)c1ccccc1)-c1ccccc1