Reaction Details
TargetNeuromedin-K receptor
LigandBDBM50074802
Substrate/Competitorn/a
Meas. Tech.ChEMBL_209565 (CHEMBL811267)
Ki 15±n/a nM
Citation Giardina, GARaveglia, LFGrugni, MSarau, HMFarina, CMedhurst, ADGraziani, DSchmidt, DBRigolio, RLuttmann, MCavagnera, SFoley, JJVecchietti, VHay, DW Discovery of a novel class of selective non-peptide antagonists for the human neurokinin-3 receptor. 2. Identification of (S)-N-(1-phenylpropyl)-3-hydroxy-2-phenylquinoline-4-carboxamide (SB 223412). J Med Chem42:1053-65 (1999) 
 
Neuromedin-K receptor
Name:Neuromedin-K receptor
Type:Enzyme
Mol. Mass.:52221.96
Organism:Homo sapiens (Human)
Description:P29371
Residue:465
BDBM50074802
NameBDBM50074802
Synonyms:3-Butyl-2-phenyl-quinoline-4-carboxylic acid (1-phenyl-propyl)-amide | CHEMBL415968
TypeSmall organic molecule
Emp. Form.C29H30N2O
Mol. Mass.422.5613
SMILESCCCCc1c(nc2ccccc2c1C(=O)NC(CC)c1ccccc1)-c1ccccc1