Reaction Details
TargetProgesterone receptor
LigandBDBM50062432
Substrate/Competitorn/a
Meas. Tech.ChEMBL_159054 (CHEMBL760106)
EC50 2.8±n/a nM
Citation Zhi, LTegley, CMMarschke, KBMais, DEJones, TK 5-Aryl-1,2,3,4-tetrahydrochromeno[3,4-f]quinolin-3-ones as a novel class of nonsteroidal progesterone receptor agonists: effect of A-ring modification. J Med Chem42:1466-72 (1999) 
 
Progesterone receptor
Name:Progesterone receptor
Type:Protein
Mol. Mass.:98979.52
Organism:Homo sapiens (Human)
Description:P06401
Residue:933
BDBM50062432
NameBDBM50062432
Synonyms:5-(3-Chloro-phenyl)-9-fluoro-2,2,4-trimethyl-2,5-dihydro-1H-6-oxa-1-aza-chrysene | CHEMBL416411
TypeSmall organic molecule
Emp. Form.C25H21ClFNO
Mol. Mass.405.892
SMILESCC1=CC(C)(C)Nc2ccc3-c4cc(F)ccc4OC(c4cccc(Cl)c4)c3c12