Reaction Details
TargetDelta-type opioid receptor
LigandBDBM50001023
Substrate/Competitorn/a
Meas. Tech.ChEMBL_147149 (CHEMBL758174)
Ki 0.580000±n/a nM
Citation Neumeyer, JLBidlack, JMZong, RBakthavachalam, VGao, PCohen, DJNegus, SSMello, NK Synthesis and opioid receptor affinity of morphinan and benzomorphan derivatives: mixed kappa agonists and mu agonists/antagonists as potential pharmacotherapeutics for cocaine dependence. J Med Chem43:114-22 (2000) Delta-type opioid receptor
Name:Delta-type opioid receptor
Type:G Protein-Coupled Receptor (GPCR)
Mol. Mass.:40382.98
Organism:Homo sapiens (Human)
Description:Competition binding assays were carried out using membrane preparations from transfected HN9.10 cells that constitutively expressed the delta opioid receptor.
Residue:372
BDBM50001023
NameBDBM50001023
Synonyms:(2R,6R,11R)-3-Cyclopropylmethyl-6,11-dimethyl-1,2,3,4,5,6-hexahydro-2,6-methano-benzo[d]azocin-8-ol CHEMBL56585 US10231963, Table B.9 US11534436, Compound Table B.9 | US9656961, Example 00126
TypeSmall organic molecule
Emp. Form.C18H25NO
Mol. Mass.271.3972
SMILESC[C@H]1[C@H]2Cc3ccc(O)cc3[C@]1(C)CCN2CC1CC1