Reaction Details
TargetMu-type opioid receptor
LigandBDBM50000091
Substrate/Competitorn/a
Meas. Tech.ChEMBL_145280 (CHEMBL751216)
Ki 0.780000±n/a nM
Citation Neumeyer, JLBidlack, JMZong, RBakthavachalam, VGao, PCohen, DJNegus, SSMello, NK Synthesis and opioid receptor affinity of morphinan and benzomorphan derivatives: mixed kappa agonists and mu agonists/antagonists as potential pharmacotherapeutics for cocaine dependence. J Med Chem43:114-22 (2000) Mu-type opioid receptor
Name:Mu-type opioid receptor
Type:Enzyme Catalytic Domain
Mol. Mass.:11165.58
Organism:GUINEA PIG
Description:P97266
Residue:98
BDBM50000091
NameBDBM50000091
Synonyms:(6S,11R)-3-Cyclopropylmethyl-6-ethyl-8-hydroxy-11-methyl-3,4,5,6-tetrahydro-2H-2,6-methano-benzo[d]azocin-1-one 3-Cyclopropylmethyl-6-ethyl-8-hydroxy-11-methyl-3,4,5,6-tetrahydro-2H-2,6-methano-benzo[d]azocin-1-one 3-Cyclopropylmethyl-6-ethyl-8-hydroxy-11-methyl-3,4,5,6-tetrahydro-2H-2,6-methano-benzo[d]azocin-1-one(Ethylketazocine, EKC) EKC | EKC(-)
TypeSmall organic molecule
Emp. Form.C19H25NO2
Mol. Mass.299.4073
SMILESCC[C@]12CCN(CC3CC3)C([C@@H]1C)C(=O)c1ccc(O)cc21