Reaction Details
TargetKappa-type opioid receptor
LigandBDBM50088377
Substrate/Competitorn/a
Meas. Tech.ChEMBL_146677 (CHEMBL753169)
Ki 0.42±n/a nM
Citation Lavecchia, AGreco, GNovellino, EVittorio, FRonsisvalle, G Modeling of kappa-opioid receptor/agonists interactions using pharmacophore-based and docking simulations. J Med Chem43:2124-34 (2000) Kappa-type opioid receptor
Name:Kappa-type opioid receptor
Type:G Protein-Coupled Receptor (GPCR)
Mol. Mass.:42744.99
Organism:Cavia porcellus (domestic guinea pig)
Description:P41144
Residue:380
BDBM50088377
NameBDBM50088377
Synonyms:1-{2-[3-(3,4-Dichloro-phenyl)-2-oxo-tetrahydro-pyrimidin-1-yl]-2-phenyl-ethyl}-pyrrolidinium
TypeSmall organic molecule
Emp. Form.C22H26Cl2N3O
Mol. Mass.419.367
SMILESClc1ccc(cc1Cl)N1CCCN([C@H](C[NH+]2CCCC2)c2ccccc2)C1=O