Reaction Details
TargetReverse transcriptase/RNaseH
LigandBDBM50369530
Substrate/Competitorn/a
Meas. Tech.ChEMBL_197433 (CHEMBL802399)
IC50>100000±n/a nM
Citation Porcari, ARPtak, RGBorysko, KZBreitenbach, JMVittori, SWotring, LLDrach, JCTownsend, LB Deoxy sugar analogues of triciribine: correlation of antiviral and antiproliferative activity with intracellular phosphorylation. J Med Chem43:2438-48 (2000) Reverse transcriptase/RNaseH
Name:Reverse transcriptase/RNaseH
Type:PROTEIN
Mol. Mass.:65229.15
Organism:Human immunodeficiency virus 1
Description:ChEMBL_1473730
Residue:566
BDBM50369530
NameBDBM50369530
Synonyms:CHEMBL1790617
TypeSmall organic molecule
Emp. Form.C13H16N6O3
Mol. Mass.304.3045
SMILESCn1nc(N)c2cn([C@@H]3O[C@H](CO)C[C@H]3O)c3ncnc1c23