Reaction Details
TargetReverse transcriptase/RNaseH
LigandBDBM50369534
Substrate/Competitorn/a
Meas. Tech.ChEMBL_197432 (CHEMBL802398)
IC50 250±n/a nM
Citation Porcari, ARPtak, RGBorysko, KZBreitenbach, JMDrach, JCTownsend, LB 6-N-Acyltriciribine analogues: structure-activity relationship between acyl carbon chain length and activity against HIV-1. J Med Chem43:2457-63 (2000) Reverse transcriptase/RNaseH
Name:Reverse transcriptase/RNaseH
Type:PROTEIN
Mol. Mass.:65229.15
Organism:Human immunodeficiency virus 1
Description:ChEMBL_1473730
Residue:566
BDBM50369534
NameBDBM50369534
Synonyms:CHEMBL607723
TypeSmall organic molecule
Emp. Form.C23H34N6O5
Mol. Mass.474.5533
SMILESCCCCCCCCCC(=O)Nc1nn(C)c2ncnc3n(cc1c23)C1O[C@H](CO)[C@@H](O)[C@H]1O