Reaction Details
TargetReverse transcriptase/RNaseH
LigandBDBM50369538
Substrate/Competitorn/a
Meas. Tech.ChEMBL_197431 (CHEMBL802397)
IC50 8400±n/a nM
Citation Porcari, ARPtak, RGBorysko, KZBreitenbach, JMDrach, JCTownsend, LB 6-N-Acyltriciribine analogues: structure-activity relationship between acyl carbon chain length and activity against HIV-1. J Med Chem43:2457-63 (2000) Reverse transcriptase/RNaseH
Name:Reverse transcriptase/RNaseH
Type:PROTEIN
Mol. Mass.:65229.15
Organism:Human immunodeficiency virus 1
Description:ChEMBL_1473730
Residue:566
BDBM50369538
NameBDBM50369538
Synonyms:CHEMBL609191
TypeSmall organic molecule
Emp. Form.C16H20N6O5
Mol. Mass.376.3672
SMILESCCC(=O)Nc1nn(C)c2ncnc3n(cc1c23)C1O[C@H](CO)[C@@H](O)[C@H]1O