Reaction Details
Target3',5'-cyclic-AMP phosphodiesterase
LigandBDBM15296
Substrate/Competitorn/a
Meas. Tech.ChEMBL_157206 (CHEMBL768857)
IC50 13000±n/a nM
Citation Watanabe, NAdachi, HTakase, YOzaki, HMatsukura, MMiyazaki, KIshibashi, KIshihara, HKodama, KNishino, MKakiki, MKabasawa, Y 4-(3-Chloro-4-methoxybenzyl)aminophthalazines: synthesis and inhibitory activity toward phosphodiesterase 5. J Med Chem43:2523-9 (2000) 3',5'-cyclic-AMP phosphodiesterase
Name:3',5'-cyclic-AMP phosphodiesterase
Synonyms:Phosphodiesterase 4A
Type:PROTEIN
Mol. Mass.:13615.65
Organism:Sus scrofa
Description:ChEMBL_155848
Residue:118
BDBM15296
NameBDBM15296
TypeSmall organic molecule
Emp. Form.C12H9N3O
Mol. Mass.211.2194
SMILESCc1[nH]c(=O)c(cc1-c1ccncc1)C#N